Adobe Flash Player 10 SWF5 Results

From Gnash Project Wiki

Jump to: navigation, search

These are the results of running the latest version of Adobe Flash Player 10 on the SWF5 testcases. Only failures are shown.

Note that the results here are usually from linux. It may be the case that the same version of Adobe Flash Player behaves differently on different platforms. In that case, results from each platform should be posted.

Contents

Date (Date-v5.swf)

 - xtrace enabled -
SWF5 - LNX 10,0,32,18

[$Id: Date.as,v 1.52 2008/04/10 16:55:11 bwy Exp $]
The pp is known to fail the next three tests
FAILED: expected: "NaN" obtained: -6.77681005679532e+19
[/home/strk/src/gnash/gnash-trunk/testsuite/actionscript.all/Date.as:344]
FAILED: expected: "Infinity" obtained: -6.77681005679532e+19
[/home/strk/src/gnash/gnash-trunk/testsuite/actionscript.all/Date.as:346]
FAILED: expected: "-Infinity" obtained: -6.77681005679532e+19
[/home/strk/src/gnash/gnash-trunk/testsuite/actionscript.all/Date.as:348]
Testing hour when setting date into/out of DST
#passed: 277
#failed: 3
#unexpected successes: 5
#total tests run: 285

Global (Global-v5.swf)

 - xtrace enabled -
SWF5 - LNX 10,0,32,18

[$Id: Global.as,v 1.51 2008/03/31 23:48:33 strk Exp $]
XFAILED: expected: ':/?=&387' obtained: :/?=&
[/home/strk/src/gnash/gnash-trunk/testsuite/actionscript.all/Global.as:144]
XFAILED: expected: ':/?=&87' obtained: :/?=&
[/home/strk/src/gnash/gnash-trunk/testsuite/actionscript.all/Global.as:152]
#passed: 148
#failed: 0
#unexpected successes: 3
#expected failures: 2
#total tests run: 153

MovieClip (MovieClip-v5.swf)

 - xtrace enabled -
SWF5 - LNX 10,0,32,18

[$Id: MovieClip.as,v 1.133 2008/05/09 13:21:08 strk Exp $]
WARNING: it has been reported that adobe flash player version 9 fails a few tests here.
         We belive those are actually adobe player bugs since older versions 
         of the player are reported to pass all tests. If you have another idea 
         we'd be glad to hear from you, just check the testcase source code.

FAILED: <empty>._name (trough getProperty(13)) returns  (expected undefined)
[/home/strk/src/gnash/gnash-trunk/testsuite/actionscript.all/MovieClip.as:1031]
Some version of Adobe Flash Player 9 are reported to have this bug
FAILED: _root._name (trough getProperty(13)) returns  (expected undefined)
[/home/strk/src/gnash/gnash-trunk/testsuite/actionscript.all/MovieClip.as:1062]
Some version of Adobe Flash Player 9 are reported to have this bug
onData called, dataLoaded: 0
onData called, dataLoaded: 1
#passed: 306
#failed: 2
#unexpected successes: 19
#total tests run: 327

ops (ops-v5.swf)

 - xtrace enabled -
SWF5 - LNX 10,0,32,18

[$Id: ops.as,v 1.38 2008/04/02 08:21:49 strk Exp $]
FAILED: expected: -1 obtained: 4294967295
[/home/strk/src/gnash/gnash-trunk/testsuite/actionscript.all/ops.as:705]
FAILED: expected: -1 obtained: 4294967295
[/home/strk/src/gnash/gnash-trunk/testsuite/actionscript.all/ops.as:708]
FAILED: expected: -1 obtained: 4294967295
[/home/strk/src/gnash/gnash-trunk/testsuite/actionscript.all/ops.as:711]
FAILED: expected: -1 obtained: 4294967295
[/home/strk/src/gnash/gnash-trunk/testsuite/actionscript.all/ops.as:714]
FAILED: expected: -1 obtained: 4294967295
[/home/strk/src/gnash/gnash-trunk/testsuite/actionscript.all/ops.as:717]
FAILED: expected: -1 obtained: 4294967295
[/home/strk/src/gnash/gnash-trunk/testsuite/actionscript.all/ops.as:720]
FAILED: expected: -1 obtained: 4294967295
[/home/strk/src/gnash/gnash-trunk/testsuite/actionscript.all/ops.as:723]
FAILED: expected: -1 obtained: 4294967295
[/home/strk/src/gnash/gnash-trunk/testsuite/actionscript.all/ops.as:726]
FAILED: expected: -2 obtained: 4294967294
[/home/strk/src/gnash/gnash-trunk/testsuite/actionscript.all/ops.as:729]
FAILED: expected: -2 obtained: 4294967294
[/home/strk/src/gnash/gnash-trunk/testsuite/actionscript.all/ops.as:732]
#passed: 211
#failed: 10
#unexpected successes: 6
#total tests run: 227

Stage (Stage-v5.swf)

 - xtrace enabled -
SWF5 - LNX 10,0,32,18

[$Id: Stage.as,v 1.32 2008/04/29 14:47:26 bwy Exp $]
FAILED: expected: "fullScreen" obtained: normal
[/home/strk/src/gnash/gnash-trunk/testsuite/actionscript.all/Stage.as:107]
FAILED: expected: "fullScreen" obtained: normal
[/home/strk/src/gnash/gnash-trunk/testsuite/actionscript.all/Stage.as:109]
#passed: 30
#failed: 2
#total tests run: 32

System (System-v5.swf)

 - xtrace enabled -
SWF5 - LNX 10,0,32,18

[$Id: System.as,v 1.26 2008/04/15 07:51:20 bwy Exp $]
FAILED: expected: 'boolean' obtained: undefined
[/home/strk/src/gnash/gnash-trunk/testsuite/actionscript.all/System.as:125]
    System.capabilities.hasIME certainly fails on the pp on
    some platforms. There's no verification that it exists at all so far.
#passed: 45
#failed: 1
#unexpected successes: 5
#total tests run: 51